Details

    • Type: Improvement Improvement
    • Status: Resolved
    • Priority: Major Major
    • Resolution: Fixed
    • Affects Version/s: 2.1.0
    • Fix Version/s: 2.2.1
    • Component/s: Web - Tapestry
    • Labels:
      None

      Description

      Doesn't work if you just bump the version number.

      [INFO] -------------------------------------------------------------
      [ERROR] COMPILATION ERROR :
      [INFO] -------------------------------------------------------------
      [ERROR] /Users/mraible/dev/appfuse/web/tapestry/src/main/java/org/appfuse/webapp/components/CheckboxSelect.java:[123,15] cannot find symbol
      symbol : method createDefaultParameterBinding(java.lang.String)
      location: class org.appfuse.webapp.components.CheckboxSelect
      [INFO] 1 error
      [INFO] -------------------------------------------------------------
      [INFO] ------------------------------------------------------------------------
      [INFO] BUILD FAILURE

        Activity

        Hide
        Matt Raible added a comment -

        Patch to allow compiling after upgrading to 5.3.

        Show
        Matt Raible added a comment - Patch to allow compiling after upgrading to 5.3.
        Hide
        Serge Eby added a comment -

        Your patch is included in the next release 5.3.2. I have a lot changes that will be merged in next week when I get a little free time.

        Show
        Serge Eby added a comment - Your patch is included in the next release 5.3.2. I have a lot changes that will be merged in next week when I get a little free time.
        Hide
        Serge Eby added a comment -

        5.3.3 is now working. Planning to upgrade to 5.3.4.

        Show
        Serge Eby added a comment - 5.3.3 is now working. Planning to upgrade to 5.3.4.

          People

          • Assignee:
            Matt Raible
            Reporter:
            Matt Raible
          • Votes:
            0 Vote for this issue
            Watchers:
            1 Start watching this issue

            Dates

            • Created:
              Updated:
              Resolved:

              Development